Pyrazine, 2-acetyl-6-ethyl

Normal alkane RI, polar column, custom temperature program

View large format table.

Column type Active phase I Reference Comment
CapillaryCarbowax 20M1617.Mihara and Masuda, 1987Program: not specified

References

Mihara and Masuda, 1987
Mihara, S.; Masuda, H., Correlation between molecular structures and retention indices of pyrazines, J. Chromatogr., 1987, 402, 309-317, https://doi.org/10.1016/0021-9673(87)80029-8 . [all data]