Thiazole, 5-methyl-2-propyl

Normal alkane RI, non-polar column, isothermal

Data compiled by: NIST Mass Spectrometry Data Center, William E. Wallace, director

Column type Packed
Active phase Apieson L
Column length (m) 2.4
Carrier gas Argon
Substrate Chromosorb G AW (80-100 mesh)
Column diameter (mm)
Phase thickness (μm)
Temperature (C) 100.
I 1083.
ReferenceGolovnya, Zhuravleva, et al., 1987
Comment MSDC-RI

References

Golovnya, Zhuravleva, et al., 1987
Golovnya, R.V.; Zhuravleva, I.L.; Yakush, E.V., Calculation of the thermidynamic values of alkylthiazoles from the Kovats retention indices on the basis on the non-linear additivity principle, Chromatographia, 1987, 23, 8, 595-598, https://doi.org/10.1007/BF02324871 . [all data]