8-Hydroxytheaspirane

Van Den Dool and Kratz RI, non-polar column, temperature ramp

View large format table.

Column type Active phase I Reference Comment
CapillaryBP-11378.Strauss, Dimitriadis, et al., 1986140. C @ 10. min, 2. K/min; Column length: 25. m; Phase thickness: 0.5 μm; Tend: 280. C
CapillaryBP-11389.Strauss, Dimitriadis, et al., 1986140. C @ 10. min, 2. K/min; Column length: 25. m; Phase thickness: 0.5 μm; Tend: 280. C
CapillaryBP-11397.Strauss, Dimitriadis, et al., 1986140. C @ 10. min, 2. K/min; Column length: 25. m; Phase thickness: 0.5 μm; Tend: 280. C
CapillaryBP-11424.Strauss, Dimitriadis, et al., 1986140. C @ 10. min, 2. K/min; Column length: 25. m; Phase thickness: 0.5 μm; Tend: 280. C

References

Strauss, Dimitriadis, et al., 1986
Strauss, C.R.; Dimitriadis, E.; Wilson, B.; Williams, P.J., Studies on the hydrolysis of two megastigma-3,6,9-triols rationalizing the origins of some volatile C13 norisoprenoids of vitis vinifera grapes, J. Agric. Food Chem., 1986, 34, 1, 145-149, https://doi.org/10.1021/jf00067a039 . [all data]