17αH-hopane

Kovats' RI, non-polar column, isothermal

View large format table.

Column type Active phase Temperature (C) I Reference Comment
CapillaryOV-101280.3146.Shlyakhov, 1984
CapillaryOV-101280.3146.Kimble, Maxwell, et al., 1974He; Column length: 45.7 m; Column diameter: 0.5 mm

References

Shlyakhov, 1984
Shlyakhov, A.F., Gas chromatography in organic geochemistry, Nedra, Moscow, 1984, 221. [all data]

Kimble, Maxwell, et al., 1974
Kimble, B.J.; Maxwell, J.R.; Philp, R.P.; Eglinton, G., Identification of steranes and triterpanes in geolipid extracts by high-resolution gas chromatography and mass spectrometry, Chem. Geol., 1974, 14, 3, 173-198, https://doi.org/10.1016/0009-2541(74)90127-2 . [all data]