2-Ethylnorbornane (endo?)

Kovats' RI, polar column, isothermal

View large format table.

Column type Active phase Temperature (C) I Reference Comment
CapillaryPEG-20M70.1020.2Tóth, 1983N2; Column length: 30. m; Column diameter: 0.3 mm

References

Tóth, 1983
Tóth, T., Use of capillary gas chromatography in collecting retention and chemical information for the analysis of complex petrochemical mixtures, J. Chromatogr., 1983, 279, 157-165, https://doi.org/10.1016/S0021-9673(01)93614-3 . [all data]