Methyl 4,8-decadienoate

Kovats' RI, polar column, temperature ramp

View large format table.

Column type Active phase I Reference Comment
CapillaryCarbowax 20M1685.Tressl, Friese, et al., 1978He, 2. K/min; Column length: 50. m; Column diameter: 0.28 mm; Tstart: 70. C; Tend: 190. C

Normal alkane RI, non-polar column, temperature ramp

View large format table.

Column type Active phase I Reference Comment
CapillaryRTX-51316.Kovacevic and Kac, 200230. m/0.25 mm/0.25 μm, He, 60. C @ 3. min, 1. K/min; Tend: 150. C

Normal alkane RI, non-polar column, custom temperature program

View large format table.

Column type Active phase I Reference Comment
CapillaryHP-11293.Kovacevic and Kac, 200225. m/0.2 mm/0.11 μm; Program: 60C (3min) => 2.5C/min => 190C (1min) => 70C/min => 240V (11min)

References

Tressl, Friese, et al., 1978
Tressl, R.; Friese, L.; Fendesack, F.; Köppler, H., Studies of the volatile composition of hops during storage, J. Agric. Food Chem., 1978, 26, 6, 1426-1430, https://doi.org/10.1021/jf60220a036 . [all data]

Kovacevic and Kac, 2002
Kovacevic, N.; Kac, M., Analytical, nutritional, and clinical methods section. Determination and verification of hop varieties by analysis of essential oils, Food Chem., 2002, 77, 4, 489-494, https://doi.org/10.1016/S0308-8146(02)00114-0 . [all data]