cis-2,4-dimethyl-thiacyclopentane

Kovats' RI, non-polar column, isothermal

View large format table.

Column type Active phase Temperature (C) I Reference Comment
CapillaryOV-101100.895.Gal'pern, Gollandskikh, et al., 1976H2; Column length: 100. m; Column diameter: 0.25 mm

References

Gal'pern, Gollandskikh, et al., 1976
Gal'pern, G.D.; Gollandskikh, N.I.; Gordadze, G.N., Application of methylene-insertion reactions to cyclic sulphides (C4H8S, C5H10S and C6H12S) to produce standard compounds for gas chromatography, J. Chromatogr., 1976, 124, 1, 43-51, https://doi.org/10.1016/S0021-9673(00)87835-8 . [all data]