Dihydroisocaryophyllene

Kovats' RI, non-polar column, isothermal

View large format table.

Column type Active phase Temperature (C) I Reference Comment
PackedApiezon L175.1503.Luisetti and Yunes, 1971N2, Celite 545; Column length: 4. m
PackedApiezon L200.1519.Luisetti and Yunes, 1971N2, Celite 545; Column length: 4. m

Kovats' RI, polar column, isothermal

View large format table.

Column type Active phase Temperature (C) I Reference Comment
PackedPEG-20M175.1661.Luisetti and Yunes, 1971N2, Celite 545; Column length: 4. m
PackedPEG-20M200.1682.Luisetti and Yunes, 1971N2, Celite 545; Column length: 4. m

References

Luisetti and Yunes, 1971
Luisetti, R.U.; Yunes, R.A., Correlation between molecular structure and GC retention of mono and sesquiterpenic hydrocarbons: The influence of shielding steric effects; a new polarity factor for stationary phases, J. Chromatogr. Sci., 1971, 9, 10, 624-631, https://doi.org/10.1093/chromsci/9.10.624 . [all data]