5-methyluridine, TMS

Van Den Dool and Kratz RI, non-polar column, custom temperature program

View large format table.

Column type Active phase I Reference Comment
PackedSE-302502.Butts, 1970He, Chromosorb W; Column length: 2. m; Program: not specified

References

Butts, 1970
Butts, W.C., Gas chromatographic separation of trimethylsilyl (TMS)-nucleosides: TMS-methoxime derivatives of cytidine and deoxycytidine, J. Chromatogr. Sci., 1970, 8, 8, 474-476, https://doi.org/10.1093/chromsci/8.8.474 . [all data]