3-Cadinene

Normal alkane RI, non-polar column, temperature ramp

View large format table.

Column type Active phase I Reference Comment
CapillaryDB-11511.Sefidkon, 200260. m/0.25 mm/0.25 μm, He, 40. C @ 5. min, 4. K/min; Tend: 280. C

References

Sefidkon, 2002
Sefidkon, F., Essential oil of Lantana camara L. occurring in Iran, Flavour Fragr. J., 2002, 17, 1, 78-80, https://doi.org/10.1002/ffj.1048 . [all data]