Benzoyl-phosphonic acid diethyl ester

Kovats' RI, non-polar column, isothermal

View large format table.

Column type Active phase Temperature (C) I Reference Comment
PackedOV-1200.1667.Rotaru and Soimu, 2002H2, Gas-Chrom Q
PackedOV-1220.1674.Rotaru and Soimu, 2002H2, Gas-Chrom Q

References

Rotaru and Soimu, 2002
Rotaru, D.; Soimu, P., Two important factors which influence the gas-chromatographic behaviour of dialkyl esters of aroylphosphonic acids, Technical paper, Institute of Chemistry, Romanian Academy, Timisoara, Romania, 2002, 4, retrieved from http://www.cael.pub.ro/cicic/chimanalitica/Two%20important%20factors%20which%20influence%20the%20gas-chromatograp%85.pdf.. [all data]