Nonacosane, 5-methyl

Normal alkane RI, non-polar column, temperature ramp

Data compiled by: NIST Mass Spectrometry Data Center, William E. Wallace, director

Column type CapillaryCapillaryCapillaryCapillaryCapillary
Active phase OV-1DB-5BP-1BP-1BP-1
Column length (m) 100.30.12.12.25.
Carrier gas HeliumHeHeliumHeliumHelium
Substrate
Column diameter (mm) 0.320.320.220.220.25
Phase thickness (μm) 0.25 0.250.250.25
Tstart (C) 30.200.100.100.160.
Tend (C) 310.280.300.300.300.
Heat rate (K/min) 5.3.2.2.1.5
Initial hold (min)
Final hold (min) 5.
I 2953.42952.2952.2953.2947.
ReferenceKrkosova, Kubinec, et al., 2007Juárez, Blomquist, et al., 2001Lockey and Oraha, 1990Lockey and Oraha, 1990Lockey and Dularay, 1986
Comment MSDC-RI MSDC-RI MSDC-RI MSDC-RI MSDC-RI

References

Krkosova, Kubinec, et al., 2007
Krkosova, Z.; Kubinec, R.; Addova, G.; Jurdakova, H.; Blasko, J.; Ostrovsky, I.; Sojak, L., Gas chromatographic - mass spectrometric characterization of monomethylalkanes from fuel diesel, Petroleum Coal, 2007, 49, 3, 51-62. [all data]

Juárez, Blomquist, et al., 2001
Juárez, P.; Blomquist, G.J.; Schofield, C.J., Hydrocarbons of Rhodnius prolixus, a Chagas disease vector, Comp. Biochem. Physiol. B: Comp. Biochem., 2001, 129, 4, 733-746, https://doi.org/10.1016/S1096-4959(01)00380-3 . [all data]

Lockey and Oraha, 1990
Lockey, K.H.; Oraha, V.S., Cuticular lipids of adult Locusta Migratoria Migratoriodes (R and F), Schstocerca Gregaria (Forskal) (Acrididae) and other orthopteran species - II. Hydrocarbons, Comp. Biochem. Physiol., 1990, 95B, 4, 721-744. [all data]

Lockey and Dularay, 1986
Lockey, K.H.; Dularay, B., Cuticular methylalkanes of adult cockroaches, Blatta orientalis and Periplaneta Americana, Comp. Biochem. Physiol., 1986, 85B, 3, 567-572. [all data]