Ginkgolide C, TMS ether

Kovats' RI, non-polar column, isothermal

Data compiled by: NIST Mass Spectrometry Data Center, William E. Wallace, director

Column type CapillaryCapillaryCapillary
Active phase HP-1HP-1HP-1
Column length (m) 25.25.25.
Carrier gas
Substrate
Column diameter (mm) 0.20.20.2
Phase thickness (μm)
Temperature (C) 290.300.310.
I 3241.93263.43285.
ReferenceGögös, 2002Gögös, 2002Gögös, 2002
Comment MSDC-RI MSDC-RI MSDC-RI

References

Gögös, 2002
Gögös, Éva, Identification and the retention index of bilobalide and ginkgolides using capillary gas chromatography, J. Chromatogr. Sci., 2002, 40, 9, 519-522, https://doi.org/10.1093/chromsci/40.9.519 . [all data]