Germacrene C

Normal alkane RI, non-polar column, custom temperature program

Data compiled by: NIST Mass Spectrometry Data Center, William E. Wallace, director

Column type CapillaryCapillaryCapillary
Active phase SE-30DB-1Methyl Silicone
Column length (m)  30.
Carrier gas  Helium
Substrate
Column diameter (mm)  0.25
Phase thickness (μm)
Program not specified35 0C 4 0C/min -> 180 0C 10 0C/min -> 250 0Cnot specified
I 1482.1502.1482.
ReferenceVinogradov, 2004de Morais, Craveiro, et al., 1996Zenkevich, 1996
Comment MSDC-RI MSDC-RI MSDC-RI

Van Den Dool and Kratz RI, polar column, temperature ramp

Data compiled by: NIST Mass Spectrometry Data Center, William E. Wallace, director

Column type CapillaryCapillaryCapillary
Active phase DB-WaxDB-WaxDB-Wax
Column length (m) 30.30.60.
Carrier gas HeHeH2
Substrate
Column diameter (mm) 0.250.250.32
Phase thickness (μm) 0.250.250.25
Tstart (C) 40.40.40.
Tend (C) 250.250.245.
Heat rate (K/min) 3.3.1.5
Initial hold (min)
Final hold (min) 20.20.20.
I 1754.1754.1754.
ReferenceFanciullino, Gancel, et al., 2005Gancel, Ollitrault, et al., 2005Gancel, Ollitrault, et al., 2003
Comment MSDC-RI MSDC-RI MSDC-RI

References

Vinogradov, 2004
Vinogradov, B.A., Production, composition, properties and application of essential oils, 2004, retrieved from http://viness.narod.ru. [all data]

de Morais, Craveiro, et al., 1996
de Morais, S.M.; Craveiro, A.A.; Machado, M.I.L.M.; Alencar, J.W.; Matos, J.A., Volatile constituents of Eugenia unifluora leaf oil from Notheastern Brazil, J. Ess. Oil Res., 1996, 8, 4, 449-451, https://doi.org/10.1080/10412905.1996.9700664 . [all data]

Zenkevich, 1996
Zenkevich, I.G., Analytical Parameters of Components of Essential Oils for their Chromatographic and Chromato-Mass Spectral Identification. Mono- and Sesquiterpenes, Rastitelnye Resursy (Plant resources), 1996, 34, 1-2, 48-58. [all data]