22-Methyl-dotriacontyl cyanide

Van Den Dool and Kratz RI, non-polar column, custom temperature program

Data compiled by: NIST Mass Spectrometry Data Center, William E. Wallace, director

Column type Capillary
Active phase BPX-5
Column length (m) 25.
Carrier gas H2
Substrate
Column diameter (mm)
Phase thickness (μm)
Program not specified
I 3687.
ReferenceSchulz, 2001
Comment MSDC-RI

References

Schulz, 2001
Schulz, S., Composition of the silk lipids of the spider Nephila clavipes, Lipids, 2001, 36, 6, 637-647, https://doi.org/10.1007/s11745-001-0768-7 . [all data]