2-phenyl-adamantane

Kovats' RI, non-polar column, isothermal

View large format table.

Column type Active phase Temperature (C) I Reference Comment
CapillarySE-30180.1796.Sarkisova and Pimerzin, 2001He; Column length: 25. m; Column diameter: 0.25 mm

References

Sarkisova and Pimerzin, 2001
Sarkisova, V.S.; Pimerzin, A.A., Synthesis, identification, and gas chromatographic characterization of some isomeric aryladamantanes, Pet. Chem. USSR (Engl. Transl.), 2001, 41, 5, 342-345. [all data]