Methyl erithro-2,3-dichlorobutanoate

Kovats' RI, non-polar column, isothermal

Data compiled by: NIST Mass Spectrometry Data Center, William E. Wallace, director

Column type CapillaryCapillaryCapillary
Active phase OV-101OV-101OV-101
Column length (m) 25.25.25.
Carrier gas N2N2N2
Substrate
Column diameter (mm) 0.30.30.3
Phase thickness (μm)
Temperature (C) 100.120.80.
I 978.971.978.
ReferenceHaken and Korhonen, 1984Haken and Korhonen, 1984Haken and Korhonen, 1984
Comment MSDC-RI MSDC-RI MSDC-RI

References

Haken and Korhonen, 1984
Haken, J.K.; Korhonen, I.O.O., Gas chromatography of homologous esters. XXIV. Studies of chlorinated methyl propanoates and butanoates on a non-polar capillary column, J. Chromatogr., 1984, 284, 474-477, https://doi.org/10.1016/S0021-9673(01)87849-3 . [all data]