Etodolac, methylated

Kovats' RI, non-polar column, temperature ramp

View large format table.

Column type Active phase I Reference Comment
CapillaryHP-12225.Maurer, Tauvel, et al., 200112. m/0.20 mm/0.33 μm, He, 100. C @ 3. min, 30. K/min, 310. C @ 8. min

References

Maurer, Tauvel, et al., 2001
Maurer, H.H.; Tauvel, F.X.; Kraemer, T., Screening procedure for detection of non-steroidal anti-inflammatory drugs and their metabolites in urine as part of a systematic toxicological analysis procedure for acidic drugs and poisons by gas chromatography-mass spectrometry after extractive methylation, J. Anal. Toxicol., 2001, 25, 237-244. [all data]