epi-Torilenol

Normal alkane RI, non-polar column, temperature ramp

View large format table.

Column type Active phase I Reference Comment
CapillaryRTX-11546.Kalemba, Marschall, et al., 200130. m/0.25 mm/0.25 μm, N2, 4. K/min; Tstart: 60. C; Tend: 300. C

References

Kalemba, Marschall, et al., 2001
Kalemba, D.; Marschall, H.; Bradesi, P., Constituents of the essential oil of Solidago gigantea Ait. (giant goldenrod), Flavour Fragr. J., 2001, 16, 1, 19-26, https://doi.org/10.1002/1099-1026(200101/02)16:1<19::AID-FFJ940>3.0.CO;2-U . [all data]