Tetrahydrofuran, 3-isopropyl-2-(3-methylcyclopent-2-enyl)

Normal alkane RI, non-polar column, custom temperature program

View large format table.

Column type Active phase I Reference Comment
CapillaryCP Sil 5 CB1390.Weyerstahl, Marschall, et al., 2000Column length: 25. m; Program: not specified

Normal alkane RI, polar column, custom temperature program

View large format table.

Column type Active phase I Reference Comment
CapillaryDB-Wax1705.Weyerstahl, Marschall, et al., 2000N2; Column length: 60. m; Phase thickness: 0.25 μm; Program: not specified

References

Weyerstahl, Marschall, et al., 2000
Weyerstahl, P.; Marschall, H.; Splittgerber, U.; Wolf, D.; Surburg, H., Constituents of Haitian vetiver oil, Flavour Fragr. J., 2000, 15, 6, 395-412, https://doi.org/10.1002/1099-1026(200011/12)15:6<395::AID-FFJ930>3.0.CO;2-9 . [all data]