2-chloroethyl heptanoate

Van Den Dool and Kratz RI, non-polar column, temperature ramp

Data compiled by: NIST Mass Spectrometry Data Center, William E. Wallace, director

Column type Capillary
Active phase SE-30
Column length (m) 25.
Carrier gas N2
Substrate
Column diameter (mm) 0.33
Phase thickness (μm)
Tstart (C) 100.
Tend (C) 320.
Heat rate (K/min) 6.
Initial hold (min)
Final hold (min)
I 1302.
ReferenceKorhonen, 1985
Comment MSDC-RI

References

Korhonen, 1985
Korhonen, I.O.O., Gas-liquid chromatographic analyses. XLIII. Retention increments for 2-chloro-, 2,2-dichloro- and 2,2,2-trichloroethyl esters of aliphatic C2-C20 n-alkanoic acids on SE-30 and OV-351 capillary columns, J. Chromatogr., 1985, 329, 43-56, https://doi.org/10.1016/S0021-9673(01)81894-X . [all data]