12-nor-Preziza-7(15)-en-2-one

Normal alkane RI, non-polar column, custom temperature program

Data compiled by: NIST Mass Spectrometry Data Center, William E. Wallace, director

Column type CapillaryCapillary
Active phase CP Sil 5 CBCP Sil 5 CB
Column length (m) 25.25.
Carrier gas  N2
Substrate
Column diameter (mm)
Phase thickness (μm)  0.39
Program not specifiednot specified
I 1566.1563.
ReferenceWeyerstahl, Marschall, et al., 2000Weyerstahl, Marschall, et al., 2000, 2
Comment MSDC-RI MSDC-RI

Normal alkane RI, non-polar column, temperature ramp

Data compiled by: NIST Mass Spectrometry Data Center, William E. Wallace, director

Column type Capillary
Active phase HP-5
Column length (m) 25.
Carrier gas He
Substrate
Column diameter (mm) 0.25
Phase thickness (μm) 0.25
Tstart (C) 50.
Tend (C) 300.
Heat rate (K/min) 5.
Initial hold (min) 5.
Final hold (min)
I 1593.
ReferenceChampagnat, Figueredo, et al., 2006
Comment MSDC-RI

References

Weyerstahl, Marschall, et al., 2000
Weyerstahl, P.; Marschall, H.; Splittgerber, U.; Wolf, D.; Surburg, H., Constituents of Haitian vetiver oil, Flavour Fragr. J., 2000, 15, 6, 395-412, https://doi.org/10.1002/1099-1026(200011/12)15:6<395::AID-FFJ930>3.0.CO;2-9 . [all data]

Weyerstahl, Marschall, et al., 2000, 2
Weyerstahl, P.; Marschall, H.; Splittgerber, U.; D., 1,7-Cyclogermacra-1(10),4-dien-15-al, a sesquiterpene with a novel skeleton, and other sesquiterpenes from Haitian vetiver oil, Flavour Fragr. J., 2000, 15, 2, 61-83, https://doi.org/10.1002/(SICI)1099-1026(200003/04)15:2<61::AID-FFJ865>3.0.CO;2-S . [all data]