trans-Dracunculifoliol

Normal alkane RI, non-polar column, custom temperature program

Data compiled by: NIST Mass Spectrometry Data Center, William E. Wallace, director

Column type Capillary
Active phase CP Sil 5 CB
Column length (m) 25.
Carrier gas
Substrate
Column diameter (mm)
Phase thickness (μm)
Program not specified
I 1582.
ReferenceWeyerstahl, Marschall, et al., 2000
Comment MSDC-RI

References

Weyerstahl, Marschall, et al., 2000
Weyerstahl, P.; Marschall, H.; Splittgerber, U.; Wolf, D.; Surburg, H., Constituents of Haitian vetiver oil, Flavour Fragr. J., 2000, 15, 6, 395-412, https://doi.org/10.1002/1099-1026(200011/12)15:6<395::AID-FFJ930>3.0.CO;2-9 . [all data]