1-Isopropenyl-4-methyl-cyclohexa-1,4-diene

Kovats' RI, non-polar column, isothermal

Data compiled by: NIST Mass Spectrometry Data Center, William E. Wallace, director

Column type Capillary
Active phase Apiezon L
Column length (m) 45.
Carrier gas
Substrate
Column diameter (mm) 0.25
Phase thickness (μm)
Temperature (C) 100.
I 1167.
ReferenceMorishita, Okano, et al., 1980
Comment MSDC-RI

References

Morishita, Okano, et al., 1980
Morishita, F.; Okano, T.; Kojima, T., Retention indices of monocyclic monoterpene hydrocarbons, Bunseki Kagaku, 1980, 29, 1, 48-53, https://doi.org/10.2116/bunsekikagaku.29.48 . [all data]