Bicyclo[4.4.0]-1,4-decadiene, 4,10-dimethyl-7-isopropyl

Van Den Dool and Kratz RI, non-polar column, temperature ramp

View large format table.

Column type Active phase I Reference Comment
CapillaryCP Sil 5 CB1533.Pfeifhofer, 200050. m/0.22 mm/0.13 μm, H2, 4. K/min, 300. C @ 10. min; Tstart: 40. C

References

Pfeifhofer, 2000
Pfeifhofer, H.W., Composition of the essential oil of Pinus canariensis Sweet ex Sprengel, Flavour Fragr. J., 2000, 15, 4, 266-270, https://doi.org/10.1002/1099-1026(200007/08)15:4<266::AID-FFJ908>3.0.CO;2-E . [all data]