Sertraline, (hydroxyketone), acetyl

Kovats' RI, non-polar column, temperature ramp

Data compiled by: NIST Mass Spectrometry Data Center, William E. Wallace, director

Column type Capillary
Active phase HP-1
Column length (m) 12.
Carrier gas He
Substrate
Column diameter (mm) 0.20
Phase thickness (μm) 0.33
Tstart (C) 100.
Tend (C) 310.
Heat rate (K/min) 30.
Initial hold (min) 3.
Final hold (min) 8.
I 2660.
ReferenceMaurer and Bickeboeller-Friedrich, 2000
Comment MSDC-RI

References

Maurer and Bickeboeller-Friedrich, 2000
Maurer, H.H.; Bickeboeller-Friedrich, J., Screening procedure for detection of antidepressants of the selective serotonin reuptake inhibitor type and their metabolites in urine as part of a modified systematic toxicological analysis procedure using gas chromatography-mass spectrometry, J. Anal. Toxicol., 2000, 24, 5, 340-347, https://doi.org/10.1093/jat/24.5.340 . [all data]