4-hydroxy-4-(3ξ-hydroxy-1-butenyl)-3,5,5-trimethylcyclohex-2-en-1-one

Normal alkane RI, non-polar column, custom temperature program

Data compiled by: NIST Mass Spectrometry Data Center, William E. Wallace, director

Column type Capillary
Active phase CP Sil 5 CB
Column length (m) 50.
Carrier gas He
Substrate
Column diameter (mm) 0.32
Phase thickness (μm) 1.2
Program 36 0C 20 K/min -> 85 0C 1 K/min -> 145 oC 3 K/min -> 250 0C
I 1768.
ReferenceGuyot-Declerck, Chevance, et al., 2000
Comment MSDC-RI

References

Guyot-Declerck, Chevance, et al., 2000
Guyot-Declerck, C.; Chevance, F.; Lermusieau, G.; Collin, S., Optimized extraction procedure for quantifying norisoprenoids in honey and honey food products, J. Agric. Food Chem., 2000, 48, 12, 5850-5855, https://doi.org/10.1021/jf000504g . [all data]