2,4-Di-O-acetyl-1,5-Anhydro-3-O-methyl-D-ribitol

Van Den Dool and Kratz RI, non-polar column, temperature ramp

View large format table.

Column type Active phase I Reference Comment
CapillaryDB-51496.07El Hilali, Lamosse, et al., 200030. m/0.25 mm/0.25 μm, He, 2. K/min; Tstart: 80. C; Tend: 300. C

References

El Hilali, Lamosse, et al., 2000
El Hilali, C.M.; Lamosse, T.A.; Gray, G.R., Authentic standards for the reductive-cleavage method. The positional isomers of partially methylated and acetylated or benzoylated 1,5-anhydroribitol, Carbohyd. Res., 2000, 329, 1, 189-194, https://doi.org/10.1016/S0008-6215(00)00172-5 . [all data]