N-cyclopentyl-N-methyl-benzamide

Kovats' RI, non-polar column, isothermal

Data compiled by: NIST Mass Spectrometry Data Center, William E. Wallace, director

Column type CapillaryCapillaryCapillaryCapillary
Active phase DB-1DB-1DB-5DB-5
Column length (m) 30.30.60.60.
Carrier gas N2N2N2N2
Substrate
Column diameter (mm) 0.2560.2560.3210.321
Phase thickness (μm) 0.250.250.250.25
Temperature (C) 170.190.170.190.
I 1785.961797.221812.071823.58
ReferenceAntonovic, Mijin, et al., 2000Antonovic, Mijin, et al., 2000Antonovic, Mijin, et al., 2000Antonovic, Mijin, et al., 2000
Comment MSDC-RI MSDC-RI MSDC-RI MSDC-RI

Kovats' RI, polar column, isothermal

View large format table.

Column type Active phase Temperature (C) I Reference Comment
CapillaryDB-Wax170.2763.7Antonovic, Mijin, et al., 200030. m/0.234 mm/0.25 μm, N2
CapillaryDB-Wax190.2775.16Antonovic, Mijin, et al., 200030. m/0.234 mm/0.25 μm, N2
CapillaryDB-Wax210.2786.2Antonovic, Mijin, et al., 200030. m/0.234 mm/0.25 μm, N2

References

Antonovic, Mijin, et al., 2000
Antonovic, D.G.; Mijin, D.Z.; Petrovic, S.D.; Stojanovic, N.D.; Nikolic, A.D., Gas chromatographic retention indices for the N-methyl-N-substituted benzamides on capillary columns, Indian J. Chem., 2000, 39B, 694-699. [all data]