N-benzyl-N-methyl-benzamide

Kovats' RI, non-polar column, isothermal

View large format table.

Column type Active phase Temperature (C) I Reference Comment
CapillaryDB-1190.1924.86Antonovic, Mijin, et al., 200030. m/0.256 mm/0.25 μm, N2
CapillaryDB-5170.1918.66Antonovic, Mijin, et al., 200060. m/0.321 mm/0.25 μm, N2
CapillaryDB-5190.1967.62Antonovic, Mijin, et al., 200060. m/0.321 mm/0.25 μm, N2

Kovats' RI, polar column, isothermal

View large format table.

Column type Active phase Temperature (C) I Reference Comment
CapillaryDB-Wax170.2634.98Antonovic, Mijin, et al., 200030. m/0.234 mm/0.25 μm, N2
CapillaryDB-Wax190.2683.76Antonovic, Mijin, et al., 200030. m/0.234 mm/0.25 μm, N2
CapillaryDB-Wax210.2732.45Antonovic, Mijin, et al., 200030. m/0.234 mm/0.25 μm, N2

References

Antonovic, Mijin, et al., 2000
Antonovic, D.G.; Mijin, D.Z.; Petrovic, S.D.; Stojanovic, N.D.; Nikolic, A.D., Gas chromatographic retention indices for the N-methyl-N-substituted benzamides on capillary columns, Indian J. Chem., 2000, 39B, 694-699. [all data]