1,3-Dioxane, 2-isopentyl-4-(2-pentenyl), 2R,4R

Normal alkane RI, polar column, temperature ramp

Data compiled by: NIST Mass Spectrometry Data Center, William E. Wallace, director

Column type Capillary
Active phase CP-Wax
Column length (m) 30.
Carrier gas He
Substrate
Column diameter (mm) 0.25
Phase thickness (μm) 0.25
Tstart (C) 50.
Tend (C) 240.
Heat rate (K/min) 4.
Initial hold (min) 3.
Final hold (min)
I 1743.
ReferenceKavvadias, Beuerle, et al., 1999
Comment MSDC-RI

References

Kavvadias, Beuerle, et al., 1999
Kavvadias, D.; Beuerle, T.; Wein, M.; Boss, B.; König, T.; Schwab, W., Novel 1,3-dioxanes from apple juice and cider, J. Agric. Food Chem., 1999, 47, 12, 5178-5183, https://doi.org/10.1021/jf990714x . [all data]