2,3-Dehydro-[14C]GA9 methyl ester

Van Den Dool and Kratz RI, non-polar column, custom temperature program

Data compiled by: NIST Mass Spectrometry Data Center, William E. Wallace, director

Column type CapillaryCapillary
Active phase OV-1OV-1
Column length (m) 25.25.
Carrier gas HeHe
Substrate
Column diameter (mm) 0.20.2
Phase thickness (μm) 0.250.25
Program 60C(2min) => 10C/min => 150C => 3C/min => 300C(10min)60C(2min) => 10C/min => 150C => 3C/min => 300C(10min)
I 2301.2298.
ReferenceDavis, Kobayashi, et al., 1999Davis, Kobayashi, et al., 1999
Comment MSDC-RI MSDC-RI

References

Davis, Kobayashi, et al., 1999
Davis, G.; Kobayashi, M.; Phinney, B.O.; Lange, T.; Croker, S.J.; Gaskin, P.; MacMillan, J., Gibberellin biosynthesis in maize. Metabolic studies with GA15, GA24, GA25, GA7, and 2,3-dehydro-GA9, Plant Physiol., 1999, 121, 3, 1037-1045, https://doi.org/10.1104/pp.121.3.1037 . [all data]