[14C] GA25 16α, 17-H2, 17-OH , methyl ester

Van Den Dool and Kratz RI, non-polar column, custom temperature program

View large format table.

Column type Active phase I Reference Comment
CapillaryOV-12738.Davis, Kobayashi, et al., 199925. m/0.2 mm/0.25 μm, He; Program: 60C(2min) => 10C/min => 150C => 3C/min => 300C(10min)
CapillaryOV-12760.Davis, Kobayashi, et al., 199925. m/0.2 mm/0.25 μm, He; Program: 60C(2min) => 10C/min => 150C => 3C/min => 300C(10min)

References

Davis, Kobayashi, et al., 1999
Davis, G.; Kobayashi, M.; Phinney, B.O.; Lange, T.; Croker, S.J.; Gaskin, P.; MacMillan, J., Gibberellin biosynthesis in maize. Metabolic studies with GA15, GA24, GA25, GA7, and 2,3-dehydro-GA9, Plant Physiol., 1999, 121, 3, 1037-1045, https://doi.org/10.1104/pp.121.3.1037 . [all data]