meta,para'-α-Hydroxydinitrodiphenylacetic acid, methyl ester

Van Den Dool and Kratz RI, non-polar column, temperature ramp

Data compiled by: NIST Mass Spectrometry Data Center, William E. Wallace, director

Column type Capillary
Active phase HP-5
Column length (m) 8.
Carrier gas He
Substrate
Column diameter (mm) 0.320
Phase thickness (μm) 0.17
Tstart (C) 110.
Tend (C) 300.
Heat rate (K/min) 10.
Initial hold (min)
Final hold (min)
I 2693.
ReferenceSoják, Perjéssy, et al., 1995
Comment MSDC-RI

References

Soják, Perjéssy, et al., 1995
Soják, L.; Perjéssy, A.; Kubinec, R.; Giumanini, A.G.; Strazzolini, P., Identification of the isomers from mono- and dinitration of α-hydroxydiphenylacetic acid by capillary gas chromatography with Fourier transform infrared and mass spectrometric detection, J. Chromatogr. A, 1995, 695, 1, 57-64, https://doi.org/10.1016/0021-9673(94)01156-9 . [all data]