allyl amyl glycolate

Kovats' RI, non-polar column, isothermal

Data compiled by: NIST Mass Spectrometry Data Center, William E. Wallace, director

Column type Capillary
Active phase SE-30
Column length (m) 40.
Carrier gas
Substrate
Column diameter (mm) 0.35
Phase thickness (μm) 0.35
Temperature (C) 100.
I 1212.8
ReferenceTudor, 1997
Comment MSDC-RI

References

Tudor, 1997
Tudor, E., Temperature dependence of the retention index for perfumery compounds on a SE-30 glass capillary column. I. Linear equations, J. Chromatogr. A, 1997, 779, 1-2, 287-297, https://doi.org/10.1016/S0021-9673(97)00453-6 . [all data]