Benzyl alcohol, rutinoside, TFA

Van Den Dool and Kratz RI, non-polar column, temperature ramp

View large format table.

Column type Active phase I Reference Comment
CapillaryDB-5MS2095.Ugliano, Bartowsky, et al., 200630. m/0.25 mm/0.25 μm, He, 125. C @ 2. min, 3. K/min, 290. C @ 30. min
CapillaryDB-52118.Sakho, Chassagne, et al., 1997H2, 60. C @ 3. min, 2. K/min; Column length: 30. m; Column diameter: 0.25 mm; Tend: 220. C

Van Den Dool and Kratz RI, non-polar column, custom temperature program

View large format table.

Column type Active phase I Reference Comment
CapillaryDB-52112.Boulanger, Chassagne, et al., 199930. m/0.25 mm/0.25 μm, H2; Program: 125C => 3C/min => 220C => 2C/min => 280C
CapillaryDB-52118.Boulanger, Chassagne, et al., 199930. m/0.25 mm/0.25 μm, H2; Program: 125C => 3C/min => 220C => 2C/min => 280C
CapillaryDB-5MS2112.Chassagne, Crouzet, et al., 199830. m/0.25 mm/0.25 μm, He; Program: 125C => 3C/min => 220C => 2C/min => 280C
CapillaryDB-5MS2118.Chassagne, Crouzet, et al., 199830. m/0.25 mm/0.25 μm, He; Program: 125C => 3C/min => 220C => 2C/min => 280C
CapillaryDB-52118.Sakho, Chassagne, et al., 1997H2; Column length: 30. m; Column diameter: 0.25 mm; Program: not specified

References

Ugliano, Bartowsky, et al., 2006
Ugliano, M.; Bartowsky, E.J.; McCarthy, J.; Moio, L.; Henschke, P.A., Hydrolysis and Transformation of Grape Glycosidically Bound Volatile Compounds during Fermentation with Three Saccharomyces Yeast Strains, J. Agric. Food Chem., 2006, 54, 17, 6322-6331, https://doi.org/10.1021/jf0607718 . [all data]

Sakho, Chassagne, et al., 1997
Sakho, M.; Chassagne, D.; Crouzet, J., African mango glycosidically bound volatile compounds, J. Agric. Food Chem., 1997, 45, 3, 883-888, https://doi.org/10.1021/jf960277b . [all data]

Boulanger, Chassagne, et al., 1999
Boulanger, R.; Chassagne, D.; Crouzet, J., Free and bound flavour components of amazonian fruits. 1: Bacuri, Flavour Fragr. J., 1999, 14, 5, 303-311, https://doi.org/10.1002/(SICI)1099-1026(199909/10)14:5<303::AID-FFJ834>3.0.CO;2-C . [all data]

Chassagne, Crouzet, et al., 1998
Chassagne, D.; Crouzet, J.; Bayonove, C.L.; Baumes, R.L., Identification of passion fruit glycosides by gas chromatography/mass spectrometry, J. Agric. Food Chem., 1998, 46, 10, 4352-4357, https://doi.org/10.1021/jf980416k . [all data]