2-(2-(2-(2-nonyloxy-ethoxy)-ethoxy)-ethoxy)-ethanol, acetate

Van Den Dool and Kratz RI, non-polar column, temperature ramp

Data compiled by: NIST Mass Spectrometry Data Center, William E. Wallace, director

Column type Capillary
Active phase DB-5
Column length (m) 20.
Carrier gas He
Substrate
Column diameter (mm) 0.25
Phase thickness (μm) 0.25
Tstart (C) 50.
Tend (C) 350.
Heat rate (K/min) 5.5
Initial hold (min)
Final hold (min)
I 2474.2
ReferenceRichter, Komarek, et al., 1997
Comment MSDC-RI

References

Richter, Komarek, et al., 1997
Richter, P.; Komarek, K.; Reznicková, I., Identification of alkylpolyethylene glycols in the residues after biodegradation of their mixtures by CGC and previous derivatization, Folia Microbiol. (Prague), 1997, 42, 5, 517-520, https://doi.org/10.1007/BF02826565 . [all data]