Perfluoro-pentan ethioic acid S-ethyl ester

Kovats' RI, non-polar column, isothermal

View large format table.

Column type Active phase Temperature (C) I Reference Comment
CapillarySE-30100.766.Kirichencko, Osipova, et al., 1997He; Column length: 25. m; Column diameter: 0.25 mm
CapillarySE-30120.757.Kirichencko, Osipova, et al., 1997He; Column length: 25. m; Column diameter: 0.25 mm
CapillarySE-30140.752.Kirichencko, Osipova, et al., 1997He; Column length: 25. m; Column diameter: 0.25 mm
CapillarySE-3080.773.Kirichencko, Osipova, et al., 1997He; Column length: 25. m; Column diameter: 0.25 mm

Kovats' RI, polar column, isothermal

View large format table.

Column type Active phase Temperature (C) I Reference Comment
CapillaryCarbowax 20M100.855.Kirichencko, Osipova, et al., 1997He; Column length: 25. m; Column diameter: 0.25 mm
CapillaryCarbowax 20M120.821.Kirichencko, Osipova, et al., 1997He; Column length: 25. m; Column diameter: 0.25 mm
CapillaryCarbowax 20M140.797.Kirichencko, Osipova, et al., 1997He; Column length: 25. m; Column diameter: 0.25 mm
CapillaryCarbowax 20M80.880.Kirichencko, Osipova, et al., 1997He; Column length: 25. m; Column diameter: 0.25 mm

References

Kirichencko, Osipova, et al., 1997
Kirichencko, V.E.; Osipova, O.A.; Pashkevich, K.I., Gas-liquid chromatography of thioesters of perfluorocarboxylic acids. 1. Characteristics of retention, Russ. Chem. Bull. (Engl. Transl.), 1997, 46, 5, 944-946, https://doi.org/10.1007/BF02496124 . [all data]