4-O-acetyl-1,5-Anhydro-2,3-di-O-methyl-L-rhamnitol

Van Den Dool and Kratz RI, non-polar column, temperature ramp

View large format table.

Column type Active phase I Reference Comment
CapillaryDB-51418.65Elvebak, Wittmeyer, et al., 199730. m/0.25 mm/0.25 μm, He, 2. K/min; Tstart: 80. C; Tend: 250. C

References

Elvebak, Wittmeyer, et al., 1997
Elvebak, L.E., II; Wittmeyer, P.; Gray, G.R., Authentic standards for the reductive-cleavage method. The positional isomers of partially methylated and acetylated or benzoylated 1,5-anhydro-L-rhamnitol, Carbohyd. Res., 1997, 299, 3, 151-158, https://doi.org/10.1016/S0008-6215(97)00008-6 . [all data]