nor-Ursodesoxycholic acid, methyl ester, TMS

Normal alkane RI, non-polar column, temperature ramp

View large format table.

Column type Active phase I Reference Comment
CapillaryCP Sil 5 CB3183.Batta, Salen, et al., 1997He, 35. K/min; Column length: 25. m; Column diameter: 0.22 mm; Tstart: 100. C; Tend: 278. C

Normal alkane RI, non-polar column, custom temperature program

View large format table.

Column type Active phase I Reference Comment
CapillaryMethyl Silicone3120.Meng, Reyes, et al., 1997Program: not specified

References

Batta, Salen, et al., 1997
Batta, A.K.; Salen, G.; Batta, M.; Earnest, D.; Alberts, D., Capillary gas-liquid chromatography of acetate-methyl esters of bile acids, J. Chromatogr. A, 1997, 766, 1-2, 286-291, https://doi.org/10.1016/S0021-9673(96)01016-3 . [all data]

Meng, Reyes, et al., 1997
Meng, L.-J.; Reyes, H.; Palma, J.; Hernandez, I.; Ribalta, J.; Sjövall, J., Effects of ursodeoxycholic acid on conjugated bile acids and progesterone metabolites in serum and urine of patients with intrahepatic cholestasis of pregnancy, J. Hepatol., 1997, 27, 6, 1029-1040, https://doi.org/10.1016/S0168-8278(97)80147-X . [all data]