3α,6β,7β,12α-Tetrahydroxy-5β-cholanoic acid, trimethylsilyl ether-methyl ester

Normal alkane RI, non-polar column, temperature ramp

View large format table.

Column type Active phase I Reference Comment
CapillaryCP Sil 5 CB3310.Batta and Salen, 1999He, 100. C @ 2. min, 35. K/min; Column length: 25. m; Column diameter: 0.22 mm; Tend: 278. C
CapillaryCP Sil 5 CB3335.Batta, Salen, et al., 1997He, 35. K/min; Column length: 25. m; Column diameter: 0.22 mm; Tstart: 100. C; Tend: 278. C
CapillaryCP Sil 5 CB3310.Batta, Aggarwal, et al., 1995He, 100. C @ 2. min, 35. K/min; Column length: 25. m; Column diameter: 0.22 mm; Tend: 278. C

References

Batta and Salen, 1999
Batta, A.K.; Salen, G., Gas chromatography of bile acids, J. Chromatogr. B, 1999, 723, 1-2, 1-16, https://doi.org/10.1016/S0378-4347(98)00528-3 . [all data]

Batta, Salen, et al., 1997
Batta, A.K.; Salen, G.; Batta, M.; Earnest, D.; Alberts, D., Capillary gas-liquid chromatography of acetate-methyl esters of bile acids, J. Chromatogr. A, 1997, 766, 1-2, 286-291, https://doi.org/10.1016/S0021-9673(96)01016-3 . [all data]

Batta, Aggarwal, et al., 1995
Batta, A.K.; Aggarwal, S.K.; Tint, G.S.; Batta, M.; Salen, G., Capillary gas-liquid chromatography of 6-hydroxylated bile acids, J. Chromatogr. A, 1995, 704, 1, 228-233, https://doi.org/10.1016/0021-9673(95)00183-N . [all data]