N,N-Di-n-propyl-amphetamine

Normal alkane RI, non-polar column, isothermal

Data compiled by: NIST Mass Spectrometry Data Center, William E. Wallace, director

Column type Packed
Active phase Apiezon L
Column length (m)
Carrier gas
Substrate
Column diameter (mm)
Phase thickness (μm)
Temperature (C) 180.
I 1534.
ReferenceHuber, Kenndler, et al., 1979
Comment MSDC-RI

References

Huber, Kenndler, et al., 1979
Huber, J.F.K.; Kenndler, E.; Reich, G., Quantitation of the Information Content of Multi-Dimensional Gas Chromatography and Low- Resolution Mass Spectrometry in the Identification of Doping Drugs, J. Chromatogr., 1979, 172, 1, 15-30, https://doi.org/10.1016/S0021-9673(00)90941-5 . [all data]