2β,12α-(OH)2GA25 methyl ester

Van Den Dool and Kratz RI, non-polar column, custom temperature program

Data compiled by: NIST Mass Spectrometry Data Center, William E. Wallace, director

Column type Capillary
Active phase BP-1
Column length (m) 25.
Carrier gas He
Substrate
Column diameter (mm) 0.2
Phase thickness (μm) 0.1
Program 60C(2min) => 10C/min => 150C => 3C/min => 300C(10min)
I 2764.
ReferenceMacMillan and Gaskin, 1996
Comment MSDC-RI

References

MacMillan and Gaskin, 1996
MacMillan, J.; Gaskin, P., Gibberellins in endosperm and embryos of Marah macrocarpus, Phytochemistry, 1996, 42, 5, 1263-1266, https://doi.org/10.1016/0031-9422(96)00179-3 . [all data]