2-(2-methyl-3-furanyldithio)pentan-3-one

Van Den Dool and Kratz RI, non-polar column, custom temperature program

Data compiled by: NIST Mass Spectrometry Data Center, William E. Wallace, director

Column type Capillary
Active phase DB-5
Column length (m) 50.
Carrier gas He
Substrate
Column diameter (mm) 0.32
Phase thickness (μm)
Program 0C => 60C/min => 60C (5min) => 4C/min => 250C
I 1593.
ReferenceMottram and Whitfield, 1995
Comment MSDC-RI

References

Mottram and Whitfield, 1995
Mottram, D.S.; Whitfield, F.B., Volatile compounds from the reaction of cysteine, ribose, and phospholipid in low-moisture systems, J. Agric. Food Chem., 1995, 43, 4, 984-988, https://doi.org/10.1021/jf00052a027 . [all data]