2,3,6-Tri-O-acetyl-1,5-Anhydro-4-O-methyl-D-mannitol

Van Den Dool and Kratz RI, non-polar column, temperature ramp

Data compiled by: NIST Mass Spectrometry Data Center, William E. Wallace, director

Column type Capillary
Active phase DB-5
Column length (m) 30.
Carrier gas He
Substrate
Column diameter (mm) 0.25
Phase thickness (μm) 0.25
Tstart (C) 80.
Tend (C) 250.
Heat rate (K/min) 2.
Initial hold (min)
Final hold (min)
I 1816.68
ReferenceElvebak, Cha, et al., 1995
Comment MSDC-RI

References

Elvebak, Cha, et al., 1995
Elvebak, L.E., II; Cha, H.J.; McNally, P.; Gray, G.R., Authentic standards for the reductive-cleavage method. The positional isomers of partially methylated and acetylated or benzoylated 1,5-anhydro-D-mannitol, Carbohyd. Res., 1995, 274, 71-83, https://doi.org/10.1016/0008-6215(95)00082-5 . [all data]