3,4,6-Tri-O-Acetyl-1,5-Anhydro-2-O-methyl-D-galactitol

Van Den Dool and Kratz RI, non-polar column, temperature ramp

Data compiled by: NIST Mass Spectrometry Data Center, William E. Wallace, director

Column type Capillary
Active phase DB-5
Column length (m) 30.
Carrier gas He
Substrate
Column diameter (mm) 0.25
Phase thickness (μm) 0.25
Tstart (C) 80.
Tend (C) 250.
Heat rate (K/min) 2.
Initial hold (min)
Final hold (min)
I 1779.3
ReferenceElvebak, Abbott, et al., 1995
Comment MSDC-RI

References

Elvebak, Abbott, et al., 1995
Elvebak, L.E., II; Abbott, C.; Wall, S.; Gray, G.R., Authentic standards for the reductive-cleavage method. The positional isomers of partially methylated and acetylated or benzoylated 1,5-anhydro-D-galactitol, Carbohyd. Res., 1995, 269, 1, 1-15, https://doi.org/10.1016/0008-6215(94)00353-H . [all data]