2,2,4,4-Tetramethylcyclobutane-1,3-diol, trans, bis-TMS ether

Kovats' RI, non-polar column, isothermal

View large format table.

Column type Active phase Temperature (C) I Reference Comment
CapillaryHP-1150.1164.Torok, Szegletes, et al., 199450. m/0.2 mm/0.5 μm, He

References

Torok, Szegletes, et al., 1994
Torok, B.; Szegletes, Z.; Molnar, A., Separation and Identification of Stereoisomeric Cyclobutanediols by Gas Chromatography-Mass Spectrometry, J. Chromatogr. A, 1994, 668, 2, 463-467, https://doi.org/10.1016/0021-9673(94)80140-1 . [all data]