Lycopsamine

Kovats' RI, non-polar column, temperature ramp

Data compiled by: NIST Mass Spectrometry Data Center, William E. Wallace, director

Column type CapillaryCapillary
Active phase OV-1DB-1
Column length (m) 30.30.
Carrier gas HeHe
Substrate
Column diameter (mm)
Phase thickness (μm)
Tstart (C) 150.170.
Tend (C) 300.300.
Heat rate (K/min) 6.10.
Initial hold (min)  5.
Final hold (min)  15.
I 2147.2145.
ReferenceEl-Shazly, El-Domiaty, et al., 1998El-Shazly, Sarg, et al., 1996
Comment MSDC-RI MSDC-RI

Normal alkane RI, non-polar column, custom temperature program

Data compiled by: NIST Mass Spectrometry Data Center, William E. Wallace, director

Column type CapillaryCapillary
Active phase DB-1DB-1
Column length (m) 30.30.
Carrier gas
Substrate
Column diameter (mm) 0.320.32
Phase thickness (μm)
Program not specifiednot specified
I 2145.2147.
ReferenceFrolich, Ober, et al., 2007Frolich, Ober, et al., 2007
Comment MSDC-RI MSDC-RI

References

El-Shazly, El-Domiaty, et al., 1998
El-Shazly, A.; El-Domiaty, M.; Witte, L.; Wink, M., Pyrrolizidine alkaloids in members of the boraginaceae from Sinai (Egypt), Biochem. Syst. Ecol., 1998, 26, 6, 619-636, https://doi.org/10.1016/S0305-1978(98)00028-3 . [all data]

El-Shazly, Sarg, et al., 1996
El-Shazly, A.; Sarg, T.; Ateya, A.; Abdel Aziz, E.; El-Dahmy, S.; Witte, L.; Wink, M., Pyrrolizidine and tetrahydroisoquinoline alkaloids from Echium humile, Phytochemistry, 1996, 42, 1, 225-230, https://doi.org/10.1016/0031-9422(95)00847-0 . [all data]