7-Tigloylplatynecine

Van Den Dool and Kratz RI, non-polar column, temperature ramp

View large format table.

Column type Active phase I Reference Comment
CapillaryDB-11855.Witte, Rubiolo, et al., 1992He, 6. K/min; Column length: 30. m; Column diameter: 0.32 mm; Tstart: 150. C; Tend: 300. C
CapillaryDB-51900.Witte, Rubiolo, et al., 1992He, 6. K/min; Column length: 30. m; Column diameter: 0.32 mm; Tstart: 150. C; Tend: 300. C

References

Witte, Rubiolo, et al., 1992
Witte, L.; Rubiolo, P.; Bicchi, C.; Hartmann, T., Comparative analysis of pyrrolizidine alkaloids from natural sources by gas chromatography-mass spectrometry, Phytochemistry, 1992, 32, 1, 187-196, https://doi.org/10.1016/0031-9422(92)80130-7 . [all data]