3-epi-GA1, MeTMSi

Kovats' RI, non-polar column, custom temperature program

View large format table.

Column type Active phase I Reference Comment
CapillaryDB-12775.Toyomasu, Tsuji, et al., 1993He; Column length: 15. m; Column diameter: 0.258 mm; Program: 120C(2min) => 16C/min => 216C(5min) => 8C/min => 280C(10min)

References

Toyomasu, Tsuji, et al., 1993
Toyomasu, T.; Tsuji, H.; Yamane, H.; Nakayama, M.; Yamaguchi, I.; Murofushi, N.; Takahashi, N.; Inoue, Y., Light effects on endogenous levels of gibberellins in photoblastic lettuce seeds, J. Plant Growth Regul., 1993, 12, 2, 85-90, https://doi.org/10.1007/BF00193238 . [all data]